Target
5-hydroxytryptamine receptor 1E
Ligand
BDBM50148831
Substrate
Meas. Tech.
ChEMBL_1557246 (CHEMBL3773621)
Ki
>10000±n/a nM
Citation
 Zhou, YMa, JLin, XHuang, XPWu, KHuang, N Structure-Based Discovery of Novel and Selective 5-Hydroxytryptamine 2B Receptor Antagonists for the Treatment of Irritable Bowel Syndrome. J Med Chem 59:707-20 (2016)  
Target
Name:
5-hydroxytryptamine receptor 1E
Synonyms:
5-HT-1E 5-Hydroxytryptamine Receptor Subtype 1E (5HT1E) 5-hydroxytryptamine receptor 1E (5-HT-1E) (S31) 5HT1E_HUMAN S31 Serotonin 1e (5-HT1e) receptor | Serotonin Receptor 1E
Type:
G Protein-Coupled Receptor (GPCR)
Mol. Mass.:
41697.80
Organism:
Homo sapiens (Human)
Description:
gi_112822
Residue:
365
  
Inhibitor
Name:
BDBM50148831
Synonyms:
CHEMBL3770342
Type:
Small organic molecule
Emp. Form.:
C14H18BrN5
Mol. Mass.:
336.23
SMILES:
NC1=NC2(CCCCC2)NC(Nc2cccc(Br)c2)=N1
: