Target
5-hydroxytryptamine receptor 2C
Ligand
BDBM50403163
Substrate
Meas. Tech.
ChEMBL_1557253 (CHEMBL3773628)
EC50
0.219±n/a nM
Citation
 Cheng, JGiguere, PMSchmerberg, CMPogorelov, VMRodriguiz, RMHuang, XPZhu, HMcCorvy, JDWetsel, WCRoth, BLKozikowski, AP Further Advances in Optimizing (2-Phenylcyclopropyl)methylamines as Novel Serotonin 2C Agonists: Effects on Hyperlocomotion, Prepulse Inhibition, and Cognition Models. J Med Chem 59:578-91 (2016)  
Target
Name:
5-hydroxytryptamine receptor 2C
Synonyms:
5-HT-1C 5-HT1C 5-HT2C-INI 5-HTR2C 5-hydroxytryptamine receptor 2C (5-HT-2C) 5HT-1C HTR1C Serotonin (5-HT3) receptor Serotonin Receptor 2C
Type:
G Protein-Coupled Receptor (GPCR)
Mol. Mass.:
51836.79
Organism:
Homo sapiens (Human)
Description:
P28335
Residue:
458
  
Inhibitor
Name:
BDBM50403163
Synonyms:
OXITRIPTAN
Type:
Small organic molecule
Emp. Form.:
C11H12N2O3
Mol. Mass.:
220.2246
SMILES:
N[C@@H](Cc1c[nH]c2ccc(O)cc12)C(O)=O
: