Target
Prostate-specific antigen
Ligand
BDBM50292533
Substrate
Meas. Tech.
ChEMBL_1558620 (CHEMBL3774273)
IC50
13000±n/a nM
Citation
 Santos, JAKondo, MYFreitas, RFdos Santos, MHRamalho, TCAssis, DMJuliano, LJuliano, MAPuzer, L The natural flavone fukugetin as a mixed-type inhibitor for human tissue kallikreins. Bioorg Med Chem Lett 26:1485-9 (2016)  
Target
Name:
Prostate-specific antigen
Synonyms:
APS KLK3 Kallikrein-3 PSA Prostate-specific antigen Seminin
Type:
PROTEIN
Mol. Mass.:
28747.53
Organism:
Homo sapiens (Human)
Description:
ChEMBL_959198
Residue:
261
  
Inhibitor
Name:
BDBM50292533
Synonyms:
CHEMBL446790 | Fukugetin
Type:
Small organic molecule
Emp. Form.:
C30H22O11
Mol. Mass.:
558.4891
SMILES:
Oc1ccc(cc1)[C@@H]1Oc2cc(O)cc(O)c2C(=O)[C@H]1c1c(O)cc(O)c2C(=O)CC(Oc12)c1ccc(O)c(O)c1
: