Target
Fatty-acid amide hydrolase 1 [30-579]
Ligand
BDBM50150582
Substrate
Meas. Tech.
ChEMBL_1558646 (CHEMBL3771523)
IC50
150±n/a nM
Citation
 Morera, EDi Marzo, VMonti, LAllarà, MSchiano Moriello, ANalli, MOrtar, GDe Petrocellis, L Arylboronic acids as dual-action FAAH and TRPV1 ligands. Bioorg Med Chem Lett 26:1401-5 (2016)  
Target
Name:
Fatty-acid amide hydrolase 1 [30-579]
Synonyms:
Anandamide amidohydrolase 1 Faah Fatty Acid Amide Hydrolase Fatty-acid amide hydrolase (FAAH) Fatty-acid amide hydrolase 1 (FAAH) Oleamide hydrolase 1
Type:
Single-pass membrane protein; homodimer
Mol. Mass.:
60474.00
Organism:
Rattus norvegicus (rat)
Description:
P97612 (aa 30-579)
Residue:
550
  
Inhibitor
Name:
BDBM50150582
Synonyms:
CHEMBL3771141
Type:
Small organic molecule
Emp. Form.:
C19H16BNO3
Mol. Mass.:
317.146
SMILES:
OB(O)c1ccc(cc1)C(=O)Nc1ccc(cc1)-c1ccccc1
: