Target
Interstitial collagenase
Ligand
BDBM50151246
Substrate
Meas. Tech.
ChEMBL_1559056 (CHEMBL3773912)
IC50
346000±n/a nM
Citation
 Camodeca, CNuti, ETepshi, LBoero, STuccinardi, TStura, EAPoggi, AZocchi, MRRossello, A Discovery of a new selective inhibitor of A Disintegrin And Metalloprotease 10 (ADAM-10) able to reduce the shedding of NKG2D ligands in Hodgkin's lymphoma cell models. Eur J Med Chem 111:193-201 (2016)  
Target
Name:
Interstitial collagenase
Synonyms:
CLG MMP1 Matrix metalloproteinase-1 | Matrix metalloproteinase-1 (MMP-1)
Type:
Enzyme
Mol. Mass.:
54010.26
Organism:
Homo sapiens (Human)
Description:
P03956
Residue:
469
  
Inhibitor
Name:
BDBM50151246
Synonyms:
CHEMBL3770935
Type:
Small organic molecule
Emp. Form.:
C16H21N5O4S2
Mol. Mass.:
411.499
SMILES:
Cc1cc(ccc1N1CCN(CC1)S(=O)(=O)N1CSC[C@@H]1C(=O)NO)C#N
: