Target
Disintegrin and metalloproteinase domain-containing protein 17
Ligand
BDBM50151246
Substrate
Meas. Tech.
ChEMBL_1559067 (CHEMBL3773923)
IC50
12000±n/a nM
Citation
 Camodeca, CNuti, ETepshi, LBoero, STuccinardi, TStura, EAPoggi, AZocchi, MRRossello, A Discovery of a new selective inhibitor of A Disintegrin And Metalloprotease 10 (ADAM-10) able to reduce the shedding of NKG2D ligands in Hodgkin's lymphoma cell models. Eur J Med Chem 111:193-201 (2016)  
Target
Name:
Disintegrin and metalloproteinase domain-containing protein 17
Synonyms:
ADA17_HUMAN CSVP Disintegrin and metalloproteinase domain-containing protein 17 (ADAM17) TNF-alpha convertase TNF-alpha-converting enzyme (TACE) Tumor necrosis factor-α converting enzyme (TACE)
Type:
Enzyme
Mol. Mass.:
93007.89
Organism:
Homo sapiens (Human)
Description:
Residue:
824
  
Inhibitor
Name:
BDBM50151246
Synonyms:
CHEMBL3770935
Type:
Small organic molecule
Emp. Form.:
C16H21N5O4S2
Mol. Mass.:
411.499
SMILES:
Cc1cc(ccc1N1CCN(CC1)S(=O)(=O)N1CSC[C@@H]1C(=O)NO)C#N
: