Target
Histone deacetylase 3
Ligand
BDBM50439674
Substrate
Meas. Tech.
ChEMBL_1560788 (CHEMBL3778485)
IC50
135±n/a nM
Citation
 Yang, ZWang, TWang, FNiu, TLiu, ZChen, XLong, CTang, MCao, DWang, XXiang, WYi, YMa, LYou, JChen, L Discovery of Selective Histone Deacetylase 6 Inhibitors Using the Quinazoline as the Cap for the Treatment of Cancer. J Med Chem 59:1455-70 (2016)  
Target
Name:
Histone deacetylase 3
Synonyms:
HD3 HDAC3_HUMAN Human HDAC3 SMAP45
Type:
Enzyme
Mol. Mass.:
48829.55
Organism:
Homo sapiens (Human)
Description:
O15379
Residue:
428
  
Inhibitor
Name:
BDBM50439674
Synonyms:
RICOLINOSTAT US11207431, Example E US8609678, 2-(diphenylamino)-N-(7-(hydroxyamino)-7-oxoheptyl)pyrimidine-5-carboxamide [26]
Type:
Small organic molecule
Emp. Form.:
C24H27N5O3
Mol. Mass.:
433.5029
SMILES:
ONC(=O)CCCCCCNC(=O)c1cnc(nc1)N(c1ccccc1)c1ccccc1
: