Target
Carbonic anhydrase 1
Ligand
BDBM10890
Substrate
Meas. Tech.
ChEMBL_1563412 (CHEMBL3782909)
Ki
31±n/a nM
Citation
 Eminoglu, AVullo, DAsik, AÇolak, DNÇanakçi, SBeldüz, AOSupuran, CT Sulfonamide inhibition studies of theß-carbonic anhydrase from the newly discovered bacterium Enterobacter sp. B13. Bioorg Med Chem Lett 26:1821-6 (2016)  
Target
Name:
Carbonic anhydrase 1
Synonyms:
CA-I CAB Carbonate dehydratase I Carbonic anhydrase 1 (CA I) Carbonic anhydrase 1 (Recombinant CA I) Carbonic anhydrase B Carbonic anhydrase I (CA I) Carbonic anhydrase I (CAI) Carbonic anhydrase isoenzyme I (hCA I) | hCA
Type:
Enzyme
Mol. Mass.:
28873.37
Organism:
Homo sapiens (Human)
Description:
P00915
Residue:
261
  
Inhibitor
Name:
BDBM10890
Synonyms:
1-N-(3-chloro-1H-indol-7-yl)benzene-1,4-disulfonamide Compound 6 Indisulam (IND) | Sulfonamide, 7
Type:
Small organic molecule
Emp. Form.:
C14H12ClN3O4S2
Mol. Mass.:
385.846
SMILES:
NS(=O)(=O)c1ccc(cc1)S(=O)(=O)Nc1cccc2c(Cl)c[nH]c12
: