Target
Solute carrier family 2, facilitated glucose transporter member 1
Ligand
BDBM50152774
Substrate
Meas. Tech.
ChEBML_1565336
IC50
49±n/a nM
Citation
 Siebeneicher, HBauser, MBuchmann, BHeisler, IMüller, TNeuhaus, RRehwinkel, HTelser, JZorn, L Identification of novel GLUT inhibitors. Bioorg Med Chem Lett 26:1732-7 (2016)  
Target
Name:
Solute carrier family 2, facilitated glucose transporter member 1
Synonyms:
GLUT-1 GTR1_HUMAN Glucose transporter HepG2 glucose transporter | SLC2A1
Type:
Protein
Mol. Mass.:
54091.71
Organism:
Homo sapiens (Human)
Description:
Residue:
492
  
Inhibitor
Name:
BDBM50152774
Synonyms:
CHEMBL3781384
Type:
Small organic molecule
Emp. Form.:
C21H21N7O
Mol. Mass.:
387.4377
SMILES:
COc1ccccc1N1CCN(CC1)c1ncnc2n(nnc12)-c1ccccc1
: