Target
Solute carrier family 2, facilitated glucose transporter member 1
Ligand
BDBM50155715
Substrate
Meas. Tech.
ChEMBL_1565336 (CHEMBL3782730)
IC50
7±n/a nM
Citation
 Siebeneicher, HBauser, MBuchmann, BHeisler, IMüller, TNeuhaus, RRehwinkel, HTelser, JZorn, L Identification of novel GLUT inhibitors. Bioorg Med Chem Lett 26:1732-7 (2016)  
Target
Name:
Solute carrier family 2, facilitated glucose transporter member 1
Synonyms:
GLUT-1 GTR1_HUMAN Glucose transporter HepG2 glucose transporter | SLC2A1
Type:
Protein
Mol. Mass.:
54091.71
Organism:
Homo sapiens (Human)
Description:
Residue:
492
  
Inhibitor
Name:
BDBM50155715
Synonyms:
CHEMBL3781149
Type:
Small organic molecule
Emp. Form.:
C21H20N6O
Mol. Mass.:
372.4231
SMILES:
Oc1ccccc1N1CCN(CC1)c1ncnc2n(ncc12)-c1ccccc1
: