Target
Solute carrier family 2, facilitated glucose transporter member 1
Ligand
BDBM50155656
Substrate
Meas. Tech.
ChEMBL_1565336 (CHEMBL3782730)
IC50
5±n/a nM
Citation
 Siebeneicher, HBauser, MBuchmann, BHeisler, IMüller, TNeuhaus, RRehwinkel, HTelser, JZorn, L Identification of novel GLUT inhibitors. Bioorg Med Chem Lett 26:1732-7 (2016)  
Target
Name:
Solute carrier family 2, facilitated glucose transporter member 1
Synonyms:
GLUT-1 GTR1_HUMAN Glucose transporter HepG2 glucose transporter | SLC2A1
Type:
Protein
Mol. Mass.:
54091.71
Organism:
Homo sapiens (Human)
Description:
Residue:
492
  
Inhibitor
Name:
BDBM50155656
Synonyms:
CHEMBL3781331
Type:
Small organic molecule
Emp. Form.:
C23H23N7O2
Mol. Mass.:
429.4744
SMILES:
COc1ccc(cc1N1CCN(CC1)c1ncnc2n(ncc12)-c1ccccc1)C(N)=O
: