Target
Lysine-specific demethylase 4D
Ligand
BDBM50153344
Substrate
Meas. Tech.
ChEMBL_1562429 (CHEMBL3778165)
IC50
1585±n/a nM
Citation
 Westaway, SMPreston, AGBarker, MDBrown, FBrown, JACampbell, MChung, CWDiallo, HDouault, CDrewes, GEagle, RGordon, LHaslam, CHayhow, TGHumphreys, PGJoberty, GKatso, RKruidenier, LLeveridge, MLiddle, JMosley, JMuelbaier, MRandle, RRioja, IRueger, ASeal, GASheppard, RJSingh, OTaylor, JThomas, PThomson, DWilson, DMLee, KPrinjha, RK Cell Penetrant Inhibitors of the KDM4 and KDM5 Families of Histone Lysine Demethylases. 1. 3-Amino-4-pyridine Carboxylate Derivatives. J Med Chem 59:1357-69 (2016)  
Target
Name:
Lysine-specific demethylase 4D
Synonyms:
JHDM3D JMJD2D Jumonji domain-containing protein 2D KDM4D_HUMAN | Lysine-specific demethylase 4D
Type:
PROTEIN
Mol. Mass.:
58627.79
Organism:
Homo sapiens (Human)
Description:
ChEMBL_102441
Residue:
523
  
Inhibitor
Name:
BDBM50153344
Synonyms:
CHEMBL3774975
Type:
Small organic molecule
Emp. Form.:
C13H10N2O3
Mol. Mass.:
242.2301
SMILES:
OC(=O)c1ccncc1NC(=O)c1ccccc1
: