Target
Lysine-specific histone demethylase 1A
Ligand
BDBM50153593
Substrate
Meas. Tech.
ChEMBL_1561095 (CHEMBL3776819)
IC50
<100±n/a nM
Citation
 Blass, B Cyclopropanamine Compounds and Use Thereof. ACS Med Chem Lett 7:10-1 (2016)  
Target
Name:
Lysine-specific histone demethylase 1A
Synonyms:
AOF2 Flavin-containing amine oxidase domain-containing protein 2 KDM1A KIAA0601 Lysine-specific demethylase 1 (LSD1) Lysine-specific histone demethylase 1 (LSD1)
Type:
Enzyme
Mol. Mass.:
92901.01
Organism:
Homo sapiens (Human)
Description:
O60341
Residue:
852
  
Inhibitor
Name:
BDBM50153593
Synonyms:
CHEMBL3775351 US10414761, Example 123 US9487511, 123 US9920047, 123
Type:
Small organic molecule
Emp. Form.:
C17H22N4OS
Mol. Mass.:
330.448
SMILES:
Cc1sc(cc1[C@@H]1C[C@H]1NC1CCC1)C(=O)Nc1cnn(C)c1
: