Target
Estrogen receptor
Ligand
BDBM50154315
Substrate
Meas. Tech.
ChEMBL_1561162 (CHEMBL3777355)
IC50
7.7±n/a nM
Citation
 Ahmed, NSElghazawy, NHElHady, AKEngel, MHartmann, RWAbadi, AH Design and synthesis of novel tamoxifen analogues that avoid CYP2D6 metabolism. Eur J Med Chem 112:171-9 (2016)  
Target
Name:
Estrogen receptor
Synonyms:
ER ESR ESR1_HUMAN Estrogen receptor Estrogen receptor (ER-alpha) Estrogen receptor alpha (ER) Nuclear receptor subfamily 3 group A member 1
Type:
Protein
Mol. Mass.:
66230.44
Organism:
Homo sapiens (Human)
Description:
P03372
Residue:
595
  
Inhibitor
Name:
BDBM50154315
Synonyms:
CHEMBL3775434
Type:
Small organic molecule
Emp. Form.:
C29H31NO3
Mol. Mass.:
441.5613
SMILES:
CC(=O)Oc1ccc(cc1)C(=C(\C)c1ccccc1)\c1ccc(OCCN2CCCC2)cc1
: