Target
D(3) dopamine receptor
Ligand
BDBM50154873
Substrate
Meas. Tech.
ChEMBL_1561630 (CHEMBL3776607)
Ki
3.2±n/a nM
Citation
 Micheli, FBernardelli, ABianchi, FBraggio, SCastelletti, LCavallini, PCavanni, PCremonesi, SDal Cin, MFeriani, AOliosi, BSemeraro, TTarsi, LTomelleri, SWong, AVisentini, FZonzini, LHeidbreder, C 1,2,4-Triazolyl octahydropyrrolo[2,3-b]pyrroles: A new series of potent and selective dopamine D3 receptor antagonists. Bioorg Med Chem 24:1619-36 (2016)  
Target
Name:
D(3) dopamine receptor
Synonyms:
DOPAMINE D3 DRD3_HUMAN Dopamine D3 receptor (D3) Dopamine receptor Dopamine receptor D3
Type:
Mol. Mass.:
44243.43
Organism:
Homo sapiens (Human)
Description:
Residue:
400
  
Inhibitor
Name:
BDBM50154873
Synonyms:
CHEMBL3775753 US10584135, Example 125
Type:
Small organic molecule
Emp. Form.:
C23H28FN7OS
Mol. Mass.:
469.578
SMILES:
COc1cc(ccc1F)N1CCC2CN(CCCSc3nnc(-c4cnccn4)n3C)CC12
: