Target
Hepatocyte growth factor receptor
Ligand
BDBM50158429
Substrate
Meas. Tech.
ChEMBL_1565901 (CHEMBL3790005)
IC50
>10000±n/a nM
Citation
 Fairhurst, RAMarsilje, THStutz, SBoos, ANiklaus, MChen, BJiang, SLu, WFuret, PMcCarthy, CStauffer, FGuagnano, VVaupel, AMichellys, PYSchnell, CJeay, S Optimisation of a 5-[3-phenyl-(2-cyclic-ether)-methyl-ether]-4-aminopyrrolopyrimidine series of IGF-1R inhibitors. Bioorg Med Chem Lett 26:2057-64 (2016)  
Target
Name:
Hepatocyte growth factor receptor
Synonyms:
Hepatocyte growth factor receptor Hepatocyte growth factor receptor (c-MET) MET Met proto-oncogene (hepatocyte growth factor receptor) Tyrosine-protein kinase Met (c-Met) c-Met kinase
Type:
Protein
Mol. Mass.:
155559.73
Organism:
Homo sapiens (Human)
Description:
P08581
Residue:
1390
  
Inhibitor
Name:
BDBM50158429
Synonyms:
CHEMBL3785500
Type:
Small organic molecule
Emp. Form.:
C27H33N5O2
Mol. Mass.:
459.5832
SMILES:
Nc1ncnc2n(cc(-c3cccc(OCC45CCC(CC4)O5)c3)c12)[C@@H]1C[C@H](CN2CCC2)C1
: