Target
Tyrosine-protein kinase JAK1
Ligand
BDBM50158429
Substrate
Meas. Tech.
ChEMBL_1565889 (CHEMBL3789993)
IC50
>10000±n/a nM
Citation
 Fairhurst, RAMarsilje, THStutz, SBoos, ANiklaus, MChen, BJiang, SLu, WFuret, PMcCarthy, CStauffer, FGuagnano, VVaupel, AMichellys, PYSchnell, CJeay, S Optimisation of a 5-[3-phenyl-(2-cyclic-ether)-methyl-ether]-4-aminopyrrolopyrimidine series of IGF-1R inhibitors. Bioorg Med Chem Lett 26:2057-64 (2016)  
Target
Name:
Tyrosine-protein kinase JAK1
Synonyms:
JAK-1 JAK1A JAK1_HUMAN Janus kinase 1 (JAK1) | Janus kinase 1 JAK1
Type:
Protein
Mol. Mass.:
133293.73
Organism:
Homo sapiens (Human)
Description:
P23458
Residue:
1154
  
Inhibitor
Name:
BDBM50158429
Synonyms:
CHEMBL3785500
Type:
Small organic molecule
Emp. Form.:
C27H33N5O2
Mol. Mass.:
459.5832
SMILES:
Nc1ncnc2n(cc(-c3cccc(OCC45CCC(CC4)O5)c3)c12)[C@@H]1C[C@H](CN2CCC2)C1
: