Target
Bromodomain-containing protein 1
Ligand
BDBM50157570
Substrate
Meas. Tech.
ChEBML_1569648
Kd
110±n/a nM
Citation
 Romero, FATaylor, AMCrawford, TDTsui, VCôté, AMagnuson, S Disrupting Acetyl-Lysine Recognition: Progress in the Development of Bromodomain Inhibitors. J Med Chem 59:1271-98 (2016)  
Target
Name:
Bromodomain-containing protein 1
Synonyms:
BR140-like protein BRD1_HUMAN BRL Bromodomain and PHD finger-containing protein 2 | Bromodomain-containing protein 1
Type:
PROTEIN
Mol. Mass.:
119557.65
Organism:
Homo sapiens (Human)
Description:
ChEMBL_105349
Residue:
1058
  
Inhibitor
Name:
BDBM50157570
Synonyms:
4-cyano-N-(1,3-dimethyl-2-oxoquinolin-6-yl)-2-methoxybenzenesulfonamide D0O6XT NI 57 US11773085, Compound B26
Type:
Small organic molecule
Emp. Form.:
C19H17N3O4S
Mol. Mass.:
383.421
SMILES:
COc1cc(ccc1S(=O)(=O)Nc1ccc2n(C)c(=O)c(C)cc2c1)C#N
: