Target
Retinoic acid receptor RXR-alpha
Ligand
BDBM50158080
Substrate
Meas. Tech.
ChEMBL_1564170 (CHEMBL3784067)
EC50
25±n/a nM
Citation
 Sundén, HSchäfer, AScheepstra, MLeysen, SMalo, MMa, JNBurstein, ESOttmann, CBrunsveld, LOlsson, R Chiral Dihydrobenzofuran Acids Show Potent Retinoid X Receptor-Nuclear Receptor Related 1 Protein Dimer Activation. J Med Chem 59:1232-8 (2016)  
Target
Name:
Retinoic acid receptor RXR-alpha
Synonyms:
NR2B1 Nuclear receptor subfamily 4 group A member 2 RXRA Retinoic acid receptor RXR-alpha/gamma Retinoid receptor
Type:
PROTEIN
Mol. Mass.:
50820.38
Organism:
Homo sapiens (Human)
Description:
ChEMBL_1456363
Residue:
462
  
Inhibitor
Name:
BDBM50158080
Synonyms:
CHEMBL3779935
Type:
Small organic molecule
Emp. Form.:
C26H30O3
Mol. Mass.:
390.5146
SMILES:
CC1(C)CCC(C)(C)c2cc3c(OC4CCCC34c3ccc(cc3)C(O)=O)cc12
: