Target
Lysine-specific demethylase 2A
Ligand
BDBM50158852
Substrate
Meas. Tech.
ChEMBL_1566075 (CHEMBL3791703)
EC50
660±n/a nM
Citation
 McAllister, TEEngland, KSHopkinson, RJBrennan, PEKawamura, ASchofield, CJ Recent Progress in Histone Demethylase Inhibitors. J Med Chem 59:1308-29 (2016)  
Target
Name:
Lysine-specific demethylase 2A
Synonyms:
AA1-1162 F-box and leucine-rich repeat protein 11 FBL7 Homo sapiens lysine demethylase 2A (KDM2A) KDM2A KIAA1004 Lysine-specific demethylase 2A (KDM2A) | NM_012308
Type:
Enzyme Catalytic Domain
Mol. Mass.:
132809.04
Organism:
Homo sapiens (Human)
Description:
Residue:
1162
  
Inhibitor
Name:
BDBM50158852
Synonyms:
CHEMBL3785340
Type:
Small organic molecule
Emp. Form.:
C21H29IN2
Mol. Mass.:
436.3728
SMILES:
[I-].CCCCCC[n+]1ccc(\C=C\c2ccc(cc2)N(C)C)cc1
: