Target
Lysine-specific demethylase 3B
Ligand
BDBM191598
Substrate
Meas. Tech.
ChEMBL_1566329 (CHEMBL3789208)
IC50
>1000±n/a nM
Citation
 McAllister, TEEngland, KSHopkinson, RJBrennan, PEKawamura, ASchofield, CJ Recent Progress in Histone Demethylase Inhibitors. J Med Chem 59:1308-29 (2016)  
Target
Name:
Lysine-specific demethylase 3B
Synonyms:
C5orf7 JMJD1B KDM3B_HUMAN Lysine-specific demethylase 3B | Lysine-specific demethylase 3B (KDM3B)
Type:
Protein
Mol. Mass.:
191594.20
Organism:
Homo sapiens (Human)
Description:
Q7LBC6
Residue:
1761
  
Inhibitor
Name:
BDBM191598
Synonyms:
2-(((2-((2-(dimethylamino)ethyl)(ethyl)amino)-2-oxoethyl)amino)methyl)isonicotinic acid (KDM5-C49) KDOAM-20
Type:
Small organic molecule
Emp. Form.:
C15H24N4O3
Mol. Mass.:
308.3761
SMILES:
CCN(CCN(C)C)C(=O)CNCc1cc(ccn1)C(O)=O
: