Target
Lysine-specific demethylase 5B
Ligand
BDBM191598
Substrate
Meas. Tech.
ChEMBL_1566343 (CHEMBL3789447)
IC50
1000±n/a nM
Citation
 McAllister, TEEngland, KSHopkinson, RJBrennan, PEKawamura, ASchofield, CJ Recent Progress in Histone Demethylase Inhibitors. J Med Chem 59:1308-29 (2016)  
Target
Name:
Lysine-specific demethylase 5B
Synonyms:
CT31 Histone demethylase JARID1B Jumonji/ARID domain-containing protein 1B KDM5B_HUMAN Lysine-specific demethylase 5B (KDM5Flag-5B-FL) PLU1 RBP2-H1 | Retinoblastoma-binding protein 2 homolog 1
Type:
Protein
Mol. Mass.:
175659.67
Organism:
Homo sapiens (Human)
Description:
Q9UGL1
Residue:
1544
  
Inhibitor
Name:
BDBM191598
Synonyms:
2-(((2-((2-(dimethylamino)ethyl)(ethyl)amino)-2-oxoethyl)amino)methyl)isonicotinic acid (KDM5-C49) KDOAM-20
Type:
Small organic molecule
Emp. Form.:
C15H24N4O3
Mol. Mass.:
308.3761
SMILES:
CCN(CCN(C)C)C(=O)CNCc1cc(ccn1)C(O)=O
: