Target
Epidermal growth factor receptor
Ligand
BDBM50029668
Substrate
Meas. Tech.
ChEMBL_1566936 (CHEMBL3790960)
IC50
150±n/a nM
Citation
 Cheng, HNair, SKMurray, BWAlmaden, CBailey, SBaxi, SBehenna, DCho-Schultz, SDalvie, DDinh, DMEdwards, MPFeng, JLFerre, RAGajiwala, KSHemkens, MDJackson-Fisher, AJalaie, MJohnson, TOKania, RSKephart, SLafontaine, JLunney, BLiu, KKLiu, ZMatthews, JNagata, ANiessen, SOrnelas, MAOrr, STPairish, MPlanken, SRen, SRichter, DRyan, KSach, NShen, HSmeal, TSolowiej, JSutton, STran, KTseng, EVernier, WWalls, MWang, SWeinrich, SLXin, SXu, HYin, MJZientek, MZhou, RKath, JC Discovery of 1-{(3R,4R)-3-[({5-Chloro-2-[(1-methyl-1H-pyrazol-4-yl)amino]-7H-pyrrolo[2,3-d]pyrimidin-4-yl}oxy)methyl]-4-methoxypyrrolidin-1-yl}prop-2-en-1-one (PF-06459988), a Potent, WT Sparing, Irreversible Inhibitor of T790M-Containing EGFR Mutants. J Med Chem 59:2005-24 (2016)  
Target
Name:
Epidermal growth factor receptor
Synonyms:
EGF Receptor Substrate EGFR_HUMAN ERBB1 Epidermal Growth Factor Receptor erbB-1 Epidermal growth factor receptor (EGFR) HER1 Proto-oncogene c-ErbB-1 Tyrosine-Protein Kinase ErbB-1
Type:
Receptor Kinase Domain
Mol. Mass.:
134279.59
Organism:
Homo sapiens (Human)
Description:
P00533
Residue:
1210
  
Inhibitor
Name:
BDBM50029668
Synonyms:
AZD-9291 US10085983, Compound AZD-9291 US11111233, Example AZD9291 US9890168, Compound AZD-9291 | WO2022090481, Example osimertinib
Type:
Small organic molecule
Emp. Form.:
C28H33N7O2
Mol. Mass.:
499.6073
SMILES:
COc1cc(N(C)CCN(C)C)c(NC(=O)C=C)cc1Nc1nccc(n1)-c1cn(C)c2ccccc12
: