Target
Metabotropic glutamate receptor 1
Ligand
BDBM50159590
Substrate
Meas. Tech.
ChEMBL_1569545 (CHEMBL3789901)
EC50
>10000±n/a nM
Citation
 Garcia-Barrantes, PMCho, HPBlobaum, ALNiswender, CMConn, PJLindsley, CW Lead optimization of the VU0486321 series of mGlu1 PAMs. Part 3. Engineering plasma stability by discovery and optimization of isoindolinone analogs. Bioorg Med Chem Lett 26:1869-72 (2016)  
Target
Name:
Metabotropic glutamate receptor 1
Synonyms:
GPRC1A GRM1_HUMAN Metabotropic Glutamate 1a | metabotropic glutamate 1
Type:
Enzyme
Mol. Mass.:
132358.19
Organism:
Homo sapiens (Human)
Description:
Q13255
Residue:
1194
  
Inhibitor
Name:
BDBM50159590
Synonyms:
CHEMBL3786738
Type:
Small organic molecule
Emp. Form.:
C18H13ClN4O3
Mol. Mass.:
368.774
SMILES:
Cc1ccoc1C(=O)Nc1ccc(N2Cc3nccnc3C2=O)c(Cl)c1
: