Target
C-X-C chemokine receptor type 3
Ligand
BDBM50159707
Substrate
Meas. Tech.
ChEBML_1569710
EC50
145±n/a nM
Citation
 Milanos, LBrox, RFrank, TPoklukar, GPalmisano, RWaibel, REinsiedel, JDürr, MIvanovic-Burmazovic, ILarsen, OHjortø, GMRosenkilde, MMTschammer, N Discovery and Characterization of Biased Allosteric Agonists of the Chemokine Receptor CXCR3. J Med Chem 59:2222-43 (2016)  
Target
Name:
C-X-C chemokine receptor type 3
Synonyms:
AAO92295.1 C-X-C chemokine receptor type 3 (CXCR3) CXCR3 CXCR3_HUMAN chemokine (C-X-C motif) receptor 3
Type:
Enzyme Catalytic Domain
Mol. Mass.:
40665.65
Organism:
Homo sapiens (Human)
Description:
Residue:
368
  
Inhibitor
Name:
BDBM50159707
Synonyms:
CHEMBL3786152
Type:
Small organic molecule
Emp. Form.:
C46H54N4O6
Mol. Mass.:
758.9442
SMILES:
CC(C)(C)OC(=O)N[C@@H](CCCCNC(=O)[C@@H]1Cc2ccccc2CN1C(=O)CCCC(=O)c1ccccc1)C(=O)NCC(c1ccccc1)c1ccccc1
: