Target
Carbonic anhydrase 1
Ligand
BDBM50427224
Substrate
Meas. Tech.
ChEBML_1567376
Ki
28000±n/a nM
Citation
 Del Prete, SVullo, DDe Luca, VCarginale, VOsman, SMAlOthman, ZSupuran, CTCapasso, C Comparison of the sulfonamide inhibition profiles of thea-,ß- and¿-carbonic anhydrases from the pathogenic bacterium Vibrio cholerae. Bioorg Med Chem Lett 26:1941-6 (2016)  
Target
Name:
Carbonic anhydrase 1
Synonyms:
CA-I CAB Carbonate dehydratase I Carbonic anhydrase 1 (CA I) Carbonic anhydrase 1 (Recombinant CA I) Carbonic anhydrase B Carbonic anhydrase I (CA I) Carbonic anhydrase I (CAI) Carbonic anhydrase isoenzyme I (hCA I) | hCA
Type:
Enzyme
Mol. Mass.:
28873.37
Organism:
Homo sapiens (Human)
Description:
P00915
Residue:
261
  
Inhibitor
Name:
BDBM50427224
Synonyms:
Benzene-1,3-Disulfonamide | CHEMBL2324868
Type:
Small organic molecule
Emp. Form.:
C6H8N2O4S2
Mol. Mass.:
236.269
SMILES:
NS(=O)(=O)c1cccc(c1)S(N)(=O)=O
: