Target
Carbonic anhydrase 1
Ligand
BDBM10862
Substrate
Meas. Tech.
ChEBML_1567376
Ki
8300±n/a nM
Citation
 Del Prete, SVullo, DDe Luca, VCarginale, VOsman, SMAlOthman, ZSupuran, CTCapasso, C Comparison of the sulfonamide inhibition profiles of thea-,ß- and¿-carbonic anhydrases from the pathogenic bacterium Vibrio cholerae. Bioorg Med Chem Lett 26:1941-6 (2016)  
Target
Name:
Carbonic anhydrase 1
Synonyms:
CA-I CAB Carbonate dehydratase I Carbonic anhydrase 1 (CA I) Carbonic anhydrase 1 (Recombinant CA I) Carbonic anhydrase B Carbonic anhydrase I (CA I) Carbonic anhydrase I (CAI) Carbonic anhydrase isoenzyme I (hCA I) | hCA
Type:
Enzyme
Mol. Mass.:
28873.37
Organism:
Homo sapiens (Human)
Description:
P00915
Residue:
261
  
Inhibitor
Name:
BDBM10862
Synonyms:
4-Amino-3-fluorobenzenesulfonamide CHEMBL6853 halogenosulfanilamide deriv. 5b
Type:
Small organic molecule
Emp. Form.:
C6H7FN2O2S
Mol. Mass.:
190.195
SMILES:
Nc1ccc(cc1F)S(N)(=O)=O
: