Target
Carbonic anhydrase 2
Ligand
BDBM50427222
Substrate
Meas. Tech.
ChEMBL_1567377 (CHEMBL3789755)
Ki
80±n/a nM
Citation
 Del Prete, SVullo, DDe Luca, VCarginale, VOsman, SMAlOthman, ZSupuran, CTCapasso, C Comparison of the sulfonamide inhibition profiles of thea-,ß- and¿-carbonic anhydrases from the pathogenic bacterium Vibrio cholerae. Bioorg Med Chem Lett 26:1941-6 (2016)  
Target
Name:
Carbonic anhydrase 2
Synonyms:
CA-II CAC Carbonate dehydratase II Carbonic anhydrase 2 (CA-II) Carbonic anhydrase C Carbonic anhydrase II (CA-II) Carbonic anhydrase II (hCA II) | Carbonic anhydrase isoenzyme II (hCA II)
Type:
Enzyme
Mol. Mass.:
29250.71
Organism:
Homo sapiens (Human)
Description:
P00918
Residue:
260
  
Inhibitor
Name:
BDBM50427222
Synonyms:
CHEMBL2324864
Type:
Small organic molecule
Emp. Form.:
C15H17N3O7S2
Mol. Mass.:
415.441
SMILES:
NS(=O)(=O)c1ccc(CCNS(=O)(=O)c2ccc(cc2CO)[N+]([O-])=O)cc1
: