Target
Carbonic anhydrase 2
Ligand
BDBM50427223
Substrate
Meas. Tech.
ChEMBL_1567377 (CHEMBL3789755)
Ki
70±n/a nM
Citation
 Del Prete, SVullo, DDe Luca, VCarginale, VOsman, SMAlOthman, ZSupuran, CTCapasso, C Comparison of the sulfonamide inhibition profiles of thea-,ß- and¿-carbonic anhydrases from the pathogenic bacterium Vibrio cholerae. Bioorg Med Chem Lett 26:1941-6 (2016)  
Target
Name:
Carbonic anhydrase 2
Synonyms:
CA-II CAC Carbonate dehydratase II Carbonic anhydrase 2 (CA-II) Carbonic anhydrase C Carbonic anhydrase II (CA-II) Carbonic anhydrase II (hCA II) | Carbonic anhydrase isoenzyme II (hCA II)
Type:
Enzyme
Mol. Mass.:
29250.71
Organism:
Homo sapiens (Human)
Description:
P00918
Residue:
260
  
Inhibitor
Name:
BDBM50427223
Synonyms:
CHEMBL2324869
Type:
Small organic molecule
Emp. Form.:
C6H5Cl2NO3S
Mol. Mass.:
242.08
SMILES:
NS(=O)(=O)c1cc(Cl)cc(Cl)c1O
: