Target
Carbonic anhydrase 2
Ligand
BDBM10873
Substrate
Meas. Tech.
ChEMBL_1567377 (CHEMBL3789755)
Ki
30±n/a nM
Citation
 Del Prete, SVullo, DDe Luca, VCarginale, VOsman, SMAlOthman, ZSupuran, CTCapasso, C Comparison of the sulfonamide inhibition profiles of thea-,ß- and¿-carbonic anhydrases from the pathogenic bacterium Vibrio cholerae. Bioorg Med Chem Lett 26:1941-6 (2016)  
Target
Name:
Carbonic anhydrase 2
Synonyms:
CA-II CAC Carbonate dehydratase II Carbonic anhydrase 2 (CA-II) Carbonic anhydrase C Carbonic anhydrase II (CA-II) Carbonic anhydrase II (hCA II) | Carbonic anhydrase isoenzyme II (hCA II)
Type:
Enzyme
Mol. Mass.:
29250.71
Organism:
Homo sapiens (Human)
Description:
P00918
Residue:
260
  
Inhibitor
Name:
BDBM10873
Synonyms:
4-[(2-aminopyrimidin-4-yl)amino]benzene-1-sulfonamide US9616064, Compound 1aa | aromatic/heteroaromatic sulfonamide 18
Type:
Small organic molecule
Emp. Form.:
C10H11N5O2S
Mol. Mass.:
265.292
SMILES:
Nc1nccc(Nc2ccc(cc2)S(N)(=O)=O)n1
: