Target
Type-1 angiotensin II receptor A
Ligand
BDBM50161275
Substrate
Meas. Tech.
ChEMBL_1566203 (CHEMBL3788344)
IC50
2.7±n/a nM
Citation
 Bao, XZhu, WZhang, RWen, CWang, LYan, YTang, HChen, Z Synthesis and evaluation of novel angiotensin II receptor 1 antagonists as anti-hypertension drugs. Bioorg Med Chem 24:2023-31 (2016)  
Target
Name:
Type-1 angiotensin II receptor A
Synonyms:
AGTRA_RAT Agtr1 Angiotensin II AT1 Angiotensin II receptor (AT-1) type-1 Type-1A angiotensin II receptor
Type:
Enzyme Catalytic Domain
Mol. Mass.:
40910.53
Organism:
RAT
Description:
ANGIOTENSIN AT1 AGTR1 RAT::P25095
Residue:
359
  
Inhibitor
Name:
BDBM50161275
Synonyms:
CHEMBL3787059
Type:
Small organic molecule
Emp. Form.:
C23H21ClN4O4
Mol. Mass.:
452.89
SMILES:
CCCCc1nc(Cl)c(C(O)=O)n1Cc1ccc(cc1)-c1ccccc1-c1noc(=O)[nH]1
: