Target
Sodium/glucose cotransporter 2
Ligand
BDBM50161716
Substrate
Meas. Tech.
ChEMBL_1567441 (CHEMBL3790124)
EC50
151±n/a nM
Citation
 Chu, KFYao, CHSong, JSChen, CTYeh, TKHsieh, TCHuang, CYWang, MHWu, SHChang, WEChao, YSLee, JC N-Indolylglycosides bearing modifications at the glucose C6-position as sodium-dependent glucose co-transporter 2 inhibitors. Bioorg Med Chem 24:2242-50 (2016)  
Target
Name:
Sodium/glucose cotransporter 2
Synonyms:
Na(+)/glucose cotransporter 2 SGLT2 Sodium-Dependent Glucose Cotransporter 2 (SGLT2) Solute carrier family 5 member 2
Type:
Protein
Mol. Mass.:
72902.00
Organism:
Homo sapiens (Human)
Description:
P31639
Residue:
672
  
Inhibitor
Name:
BDBM50161716
Synonyms:
CHEMBL3785254
Type:
Small organic molecule
Emp. Form.:
C28H33Cl2N3O5
Mol. Mass.:
562.485
SMILES:
O[C@@H]1[C@@H](CNC(=O)NCCCCl)O[C@H]([C@H](O)[C@H]1O)n1cc(Cc2ccc(cc2)C2CC2)c2c(Cl)cccc12
: