Target
Sodium/glucose cotransporter 1
Ligand
BDBM50335145
Substrate
Meas. Tech.
ChEMBL_1567442 (CHEMBL3790125)
EC50
488±n/a nM
Citation
 Chu, KFYao, CHSong, JSChen, CTYeh, TKHsieh, TCHuang, CYWang, MHWu, SHChang, WEChao, YSLee, JC N-Indolylglycosides bearing modifications at the glucose C6-position as sodium-dependent glucose co-transporter 2 inhibitors. Bioorg Med Chem 24:2242-50 (2016)  
Target
Name:
Sodium/glucose cotransporter 1
Synonyms:
High affinity sodium-glucose cotransporter Na(+)/glucose cotransporter 1 SGLT1 Sodium-dependent glucose cotransporter 1 (SGLT1) Sodium/glucose cotransporter 1 (SGLT1) | Solute carrier family 5 member 1
Type:
Protein
Mol. Mass.:
73503.78
Organism:
Homo sapiens (Human)
Description:
P13866
Residue:
664
  
Inhibitor
Name:
BDBM50335145
Synonyms:
4-Chloro-3-(4-cyclopropylbenzyl)-1-(beta-D-xylopyranosyl)-1Hindole | CHEMBL1650501
Type:
Small organic molecule
Emp. Form.:
C23H24ClNO4
Mol. Mass.:
413.894
SMILES:
O[C@@H]1CO[C@H]([C@H](O)[C@H]1O)n1cc(Cc2ccc(cc2)C2CC2)c2c(Cl)cccc12
: