Target
Carbonic anhydrase 13
Ligand
BDBM50163859
Substrate
Meas. Tech.
ChEMBL_1572883 (CHEMBL3801019)
Kd
33±n/a nM
Citation
 Talibov, VOLinkuviene, VMatulis, DDanielson, UH Kinetically Selective Inhibitors of Human Carbonic Anhydrase Isozymes I, II, VII, IX, XII, and XIII. J Med Chem 59:2083-93 (2016)  
Target
Name:
Carbonic anhydrase 13
Synonyms:
CA13 Carbonic anhydrase Carbonic anhydrase XIII (CA XIII)
Type:
Enzyme
Mol. Mass.:
29445.78
Organism:
Homo sapiens (Human)
Description:
Q8N1Q1
Residue:
262
  
Inhibitor
Name:
BDBM50163859
Synonyms:
CHEMBL3797835 | carbonic anhydrase (CA) inhibitors, benzenesulphonamide ligand, 12
Type:
Small organic molecule
Emp. Form.:
C17H25F3N2O2S2
Mol. Mass.:
410.518
SMILES:
CCCSc1c(F)c(F)c(c(NC2CCCCCCC2)c1F)S(N)(=O)=O
: