Target
Carbonic anhydrase 13
Ligand
BDBM50163861
Substrate
Meas. Tech.
ChEMBL_1572883 (CHEMBL3801019)
Kd
50±n/a nM
Citation
 Talibov, VOLinkuviene, VMatulis, DDanielson, UH Kinetically Selective Inhibitors of Human Carbonic Anhydrase Isozymes I, II, VII, IX, XII, and XIII. J Med Chem 59:2083-93 (2016)  
Target
Name:
Carbonic anhydrase 13
Synonyms:
CA13 Carbonic anhydrase Carbonic anhydrase XIII (CA XIII)
Type:
Enzyme
Mol. Mass.:
29445.78
Organism:
Homo sapiens (Human)
Description:
Q8N1Q1
Residue:
262
  
Inhibitor
Name:
BDBM50163861
Synonyms:
CHEMBL3799945 | carbonic anhydrase (CA) inhibitors, benzenesulphonamide ligand, 15
Type:
Small organic molecule
Emp. Form.:
C14H12F4N2O3S
Mol. Mass.:
364.315
SMILES:
COc1ccc(CNc2c(F)c(F)c(F)c(F)c2S(N)(=O)=O)cc1
: