Target
Carbonic anhydrase 12
Ligand
BDBM50163859
Substrate
Meas. Tech.
ChEMBL_1572898 (CHEMBL3801221)
pH
6±n/a
Kd
2600±n/a nM
Comments
extracted
Citation
 Talibov, VOLinkuviene, VMatulis, DDanielson, UH Kinetically Selective Inhibitors of Human Carbonic Anhydrase Isozymes I, II, VII, IX, XII, and XIII. J Med Chem 59:2083-93 (2016)  
Target
Name:
Carbonic anhydrase 12
Synonyms:
CA-XII CAH12_HUMAN Carbonic anhydrase Carbonic anhydrase XII Carbonic anhydrase XII (CAXII) | Tumor antigen HOM-RCC-3.1.3
Type:
Enzyme
Mol. Mass.:
39456.00
Organism:
Homo sapiens (Human)
Description:
Catalytic domain of human cloned isozyme was used in the assay
Residue:
354
  
Inhibitor
Name:
BDBM50163859
Synonyms:
CHEMBL3797835 | carbonic anhydrase (CA) inhibitors, benzenesulphonamide ligand, 12
Type:
Small organic molecule
Emp. Form.:
C17H25F3N2O2S2
Mol. Mass.:
410.518
SMILES:
CCCSc1c(F)c(F)c(c(NC2CCCCCCC2)c1F)S(N)(=O)=O
: