Target
Carbonic anhydrase 9
Ligand
BDBM50380144
Substrate
Meas. Tech.
ChEMBL_1572905 (CHEMBL3801228)
pH
7±n/a
Kd
46±n/a nM
Comments
extracted
Citation
 Talibov, VOLinkuviene, VMatulis, DDanielson, UH Kinetically Selective Inhibitors of Human Carbonic Anhydrase Isozymes I, II, VII, IX, XII, and XIII. J Med Chem 59:2083-93 (2016)  
Target
Name:
Carbonic anhydrase 9
Synonyms:
CA-IX CAH9_HUMAN Carbonic anhydrase 9 (CA IX) Carbonic anhydrase 9 precursor Carbonic anhydrase IX (CAIX) Carbonic anhydrases; II & IX MN RCC-associated antigen G250
Type:
Enzyme
Mol. Mass.:
49669.03
Organism:
Homo sapiens (Human)
Description:
Catalytic domain of human cloned isozyme was used in the assay
Residue:
459
  
Inhibitor
Name:
BDBM50380144
Synonyms:
CHEMBL2010994 | carbonic anhydrase (CA) inhibitors, benzenesulphonamide ligand, 8
Type:
Small organic molecule
Emp. Form.:
C16H19N3O4S2
Mol. Mass.:
381.47
SMILES:
CC(C)(C)c1cc(=O)[nH]c(SCC(=O)c2ccc(cc2)S(N)(=O)=O)n1
: