Target
Carbonic anhydrase 1
Ligand
BDBM50163859
Substrate
Meas. Tech.
ChEMBL_1572863 (CHEMBL3800999)
Kd
9100±n/a nM
Citation
 Talibov, VOLinkuviene, VMatulis, DDanielson, UH Kinetically Selective Inhibitors of Human Carbonic Anhydrase Isozymes I, II, VII, IX, XII, and XIII. J Med Chem 59:2083-93 (2016)  
Target
Name:
Carbonic anhydrase 1
Synonyms:
CA-I CAB Carbonate dehydratase I Carbonic anhydrase 1 (CA I) Carbonic anhydrase 1 (Recombinant CA I) Carbonic anhydrase B Carbonic anhydrase I (CA I) Carbonic anhydrase I (CAI) Carbonic anhydrase isoenzyme I (hCA I) | hCA
Type:
Enzyme
Mol. Mass.:
28873.37
Organism:
Homo sapiens (Human)
Description:
P00915
Residue:
261
  
Inhibitor
Name:
BDBM50163859
Synonyms:
CHEMBL3797835 | carbonic anhydrase (CA) inhibitors, benzenesulphonamide ligand, 12
Type:
Small organic molecule
Emp. Form.:
C17H25F3N2O2S2
Mol. Mass.:
410.518
SMILES:
CCCSc1c(F)c(F)c(c(NC2CCCCCCC2)c1F)S(N)(=O)=O
: