Target
Carbonic anhydrase 2
Ligand
BDBM50163861
Substrate
Meas. Tech.
ChEMBL_1572866 (CHEMBL3801002)
Kd
66±n/a nM
Citation
 Talibov, VOLinkuviene, VMatulis, DDanielson, UH Kinetically Selective Inhibitors of Human Carbonic Anhydrase Isozymes I, II, VII, IX, XII, and XIII. J Med Chem 59:2083-93 (2016)  
Target
Name:
Carbonic anhydrase 2
Synonyms:
CA-II CAC Carbonate dehydratase II Carbonic anhydrase 2 (CA-II) Carbonic anhydrase C Carbonic anhydrase II (CA-II) Carbonic anhydrase II (hCA II) | Carbonic anhydrase isoenzyme II (hCA II)
Type:
Enzyme
Mol. Mass.:
29250.71
Organism:
Homo sapiens (Human)
Description:
P00918
Residue:
260
  
Inhibitor
Name:
BDBM50163861
Synonyms:
CHEMBL3799945 | carbonic anhydrase (CA) inhibitors, benzenesulphonamide ligand, 15
Type:
Small organic molecule
Emp. Form.:
C14H12F4N2O3S
Mol. Mass.:
364.315
SMILES:
COc1ccc(CNc2c(F)c(F)c(F)c(F)c2S(N)(=O)=O)cc1
: