Target
Carbonic anhydrase 2
Ligand
BDBM50329832
Substrate
Meas. Tech.
ChEMBL_1572867 (CHEMBL3801003)
Kd
590±n/a nM
Citation
 Talibov, VOLinkuviene, VMatulis, DDanielson, UH Kinetically Selective Inhibitors of Human Carbonic Anhydrase Isozymes I, II, VII, IX, XII, and XIII. J Med Chem 59:2083-93 (2016)  
Target
Name:
Carbonic anhydrase 2
Synonyms:
CA-II CAC Carbonate dehydratase II Carbonic anhydrase 2 (CA-II) Carbonic anhydrase C Carbonic anhydrase II (CA-II) Carbonic anhydrase II (hCA II) | Carbonic anhydrase isoenzyme II (hCA II)
Type:
Enzyme
Mol. Mass.:
29250.71
Organism:
Homo sapiens (Human)
Description:
P00918
Residue:
260
  
Inhibitor
Name:
BDBM50329832
Synonyms:
5-(1H-Benzimidazol-1-ylacetyl)-2-chlorobenzenesulfonamide N-alkylated benzimidazole derivative, 4a | carbonic anhydrase (CA) inhibitors, benzenesulphonamide ligand, 4
Type:
Small organic molecule
Emp. Form.:
C15H12ClN3O3S
Mol. Mass.:
349.792
SMILES:
NS(=O)(=O)c1cc(ccc1Cl)C(=O)Cn1cnc2ccccc12
: