Target
Carbonic anhydrase 9
Ligand
BDBM50380140
Substrate
Meas. Tech.
ChEMBL_1572874 (CHEMBL3801010)
Kd
200±n/a nM
Citation
 Talibov, VOLinkuviene, VMatulis, DDanielson, UH Kinetically Selective Inhibitors of Human Carbonic Anhydrase Isozymes I, II, VII, IX, XII, and XIII. J Med Chem 59:2083-93 (2016)  
Target
Name:
Carbonic anhydrase 9
Synonyms:
CA-IX CAH9_HUMAN Carbonic anhydrase 9 (CA IX) Carbonic anhydrase 9 precursor Carbonic anhydrase IX (CAIX) Carbonic anhydrases; II & IX MN RCC-associated antigen G250
Type:
Enzyme
Mol. Mass.:
49669.03
Organism:
Homo sapiens (Human)
Description:
Catalytic domain of human cloned isozyme was used in the assay
Residue:
459
  
Inhibitor
Name:
BDBM50380140
Synonyms:
CHEMBL2011155 | carbonic anhydrase (CA) inhibitors, benzenesulphonamide ligand, 10
Type:
Small organic molecule
Emp. Form.:
C12H10ClN3O3S2
Mol. Mass.:
343.809
SMILES:
NS(=O)(=O)c1cc(ccc1Cl)C(=O)CSc1ncccn1
: