Target
Carbonic anhydrase 9
Ligand
BDBM50163859
Substrate
Meas. Tech.
ChEMBL_1572874 (CHEMBL3801010)
Kd
27±n/a nM
Citation
 Talibov, VOLinkuviene, VMatulis, DDanielson, UH Kinetically Selective Inhibitors of Human Carbonic Anhydrase Isozymes I, II, VII, IX, XII, and XIII. J Med Chem 59:2083-93 (2016)  
Target
Name:
Carbonic anhydrase 9
Synonyms:
CA-IX CAH9_HUMAN Carbonic anhydrase 9 (CA IX) Carbonic anhydrase 9 precursor Carbonic anhydrase IX (CAIX) Carbonic anhydrases; II & IX MN RCC-associated antigen G250
Type:
Enzyme
Mol. Mass.:
49669.03
Organism:
Homo sapiens (Human)
Description:
Catalytic domain of human cloned isozyme was used in the assay
Residue:
459
  
Inhibitor
Name:
BDBM50163859
Synonyms:
CHEMBL3797835 | carbonic anhydrase (CA) inhibitors, benzenesulphonamide ligand, 12
Type:
Small organic molecule
Emp. Form.:
C17H25F3N2O2S2
Mol. Mass.:
410.518
SMILES:
CCCSc1c(F)c(F)c(c(NC2CCCCCCC2)c1F)S(N)(=O)=O
: