Target
D(3) dopamine receptor
Ligand
BDBM55121
Substrate
Meas. Tech.
ChEMBL_1576324 (CHEMBL3801674)
EC50
2.7±n/a nM
Citation
 Zou, MFKeck, TMKumar, VDonthamsetti, PMichino, MBurzynski, CSchweppe, CBonifazi, AFree, RBSibley, DRJanowsky, AShi, LJavitch, JANewman, AH Novel Analogues of (R)-5-(Methylamino)-5,6-dihydro-4H-imidazo[4,5,1-ij]quinolin-2(1H)-one (Sumanirole) Provide Clues to Dopamine D2/D3 Receptor Agonist Selectivity. J Med Chem 59:2973-88 (2016)  
Target
Name:
D(3) dopamine receptor
Synonyms:
DOPAMINE D3 DRD3_HUMAN Dopamine D3 receptor (D3) Dopamine receptor Dopamine receptor D3
Type:
Mol. Mass.:
44243.43
Organism:
Homo sapiens (Human)
Description:
Residue:
400
  
Inhibitor
Name:
BDBM55121
Synonyms:
3-HYDROXYTYRAMINE HYDROCHLORIDE 4-(2-aminoethyl)pyrocatechol;hydrochloride Dopamine SMR000059081 | cid_65340
Type:
Small organic molecule
Emp. Form.:
C8H11NO2
Mol. Mass.:
153.1784
SMILES:
NCCc1ccc(O)c(O)c1
: