Target
D(3) dopamine receptor
Ligand
BDBM50164880
Substrate
Meas. Tech.
ChEMBL_1576324 (CHEMBL3801674)
EC50
56±n/a nM
Citation
 Zou, MFKeck, TMKumar, VDonthamsetti, PMichino, MBurzynski, CSchweppe, CBonifazi, AFree, RBSibley, DRJanowsky, AShi, LJavitch, JANewman, AH Novel Analogues of (R)-5-(Methylamino)-5,6-dihydro-4H-imidazo[4,5,1-ij]quinolin-2(1H)-one (Sumanirole) Provide Clues to Dopamine D2/D3 Receptor Agonist Selectivity. J Med Chem 59:2973-88 (2016)  
Target
Name:
D(3) dopamine receptor
Synonyms:
DOPAMINE D3 DRD3_HUMAN Dopamine D3 receptor (D3) Dopamine receptor Dopamine receptor D3
Type:
Mol. Mass.:
44243.43
Organism:
Homo sapiens (Human)
Description:
Residue:
400
  
Inhibitor
Name:
BDBM50164880
Synonyms:
CHEMBL3800165
Type:
Small organic molecule
Emp. Form.:
C16H23N3O
Mol. Mass.:
273.3733
SMILES:
CCCN[C@@H]1Cc2cccc3n(CCC)c(=O)n(C1)c23
: