Target
Calmodulin
Ligand
BDBM61401
Substrate
Meas. Tech.
ChEMBL_1572741 (CHEMBL3804250)
EC50
2100±n/a nM
Citation
 Bruno, CCavalluzzi, MMRusciano, MRLovece, ACarrieri, APracella, RGiannuzzi, GPolimeno, LViale, MIllario, MFranchini, CLentini, G The chemosensitizing agent lubeluzole binds calmodulin and inhibits Ca(2+)/calmodulin-dependent kinase II. Eur J Med Chem 116:36-45 (2016)  
Target
Name:
Calmodulin
Synonyms:
CALM CAM
Type:
PROTEIN
Mol. Mass.:
16813.73
Organism:
Bos taurus
Description:
ChEMBL_1458985
Residue:
149
  
Inhibitor
Name:
BDBM61401
Synonyms:
3,3-diphenyl-N-(1-phenylethyl)-1-propanamine;hydrochloride 3,3-diphenylpropyl(1-phenylethyl)amine;hydrochloride FENDILINE HYDROCHLORIDE SMR000058827 | cid_5702162
Type:
Small organic molecule
Emp. Form.:
C23H25N
Mol. Mass.:
315.4513
SMILES:
CC(NCCC(c1ccccc1)c1ccccc1)c1ccccc1
: