Target
Epidermal growth factor receptor
Ligand
BDBM50165847
Substrate
Meas. Tech.
ChEMBL_1574498 (CHEMBL3804124)
IC50
57000±n/a nM
Citation
 Sweidan, KSabbah, DABardaweel, SDush, KASheikha, GAMubarak, MS Computer-aided design, synthesis, and biological evaluation of new indole-2-carboxamide derivatives as PI3Ka/EGFR inhibitors. Bioorg Med Chem Lett 26:2685-90 (2016)  
Target
Name:
Epidermal growth factor receptor
Synonyms:
EGF Receptor Substrate EGFR_HUMAN ERBB1 Epidermal Growth Factor Receptor erbB-1 Epidermal growth factor receptor (EGFR) HER1 Proto-oncogene c-ErbB-1 Tyrosine-Protein Kinase ErbB-1
Type:
Receptor Kinase Domain
Mol. Mass.:
134279.59
Organism:
Homo sapiens (Human)
Description:
P00533
Residue:
1210
  
Inhibitor
Name:
BDBM50165847
Synonyms:
CHEMBL3800262
Type:
Small organic molecule
Emp. Form.:
C17H14N2O2
Mol. Mass.:
278.3053
SMILES:
CC(=O)c1cccc(NC(=O)c2cc3ccccc3[nH]2)c1
: