Target
Fatty-acid amide hydrolase 1
Ligand
BDBM50166866
Substrate
Meas. Tech.
ChEMBL_1573063 (CHEMBL3802167)
IC50
0.070000±n/a nM
Citation
 Pember, SOMejia, GLPrice, TJPasteris, RJ Piperidinyl thiazole isoxazolines: A new series of highly potent, slowly reversible FAAH inhibitors with analgesic properties. Bioorg Med Chem Lett 26:2965-2973 (2016)  
Target
Name:
Fatty-acid amide hydrolase 1
Synonyms:
Anandamide amidohydrolase FAAH FAAH1_HUMAN Fatty-acid amide hydrolase (FAAH) Oleamide hydrolase 1
Type:
Protein
Mol. Mass.:
63071.19
Organism:
Homo sapiens (Human)
Description:
O00519
Residue:
579
  
Inhibitor
Name:
BDBM50166866
Synonyms:
CHEMBL3798156
Type:
Small organic molecule
Emp. Form.:
C24H23N3O3S
Mol. Mass.:
433.523
SMILES:
O=C(Oc1ccccc1)N1CCC(CC1)c1nc(cs1)C1=NOC(C1)c1ccccc1
: