Target
Beta-1 adrenergic receptor
Ligand
BDBM50167066
Substrate
Meas. Tech.
ChEMBL_1573518 (CHEMBL3801473)
Ki
5.8±n/a nM
Citation
 Weichert, DStanek, MHübner, HGmeiner, P Structure-guided development of dualß2 adrenergic/dopamine D2 receptor agonists. Bioorg Med Chem 24:2641-53 (2016)  
Target
Name:
Beta-1 adrenergic receptor
Synonyms:
ADRB1_MOUSE Adrb1r Beta-1 adrenergic receptor Beta-1 adrenoreceptor
Type:
PROTEIN
Mol. Mass.:
50507.75
Organism:
Mus musculus
Description:
ChEMBL_105090
Residue:
466
  
Inhibitor
Name:
BDBM50167066
Synonyms:
CHEMBL3800400
Type:
Small organic molecule
Emp. Form.:
C29H32N2O5
Mol. Mass.:
488.5748
SMILES:
COc1cc(CCNC[C@H](O)c2ccc(O)c3[nH]c(=O)ccc23)ccc1OCCCc1ccccc1
: