Target
C-terminal-binding protein 2
Ligand
BDBM50167963
Substrate
Meas. Tech.
ChEMBL_1574551 (CHEMBL3804623)
IC50
>300000±n/a nM
Citation
 Korwar, SMorris, BLParikh, HICoover, RADoughty, TWLove, IMHilbert, BJRoyer, WEKellogg, GEGrossman, SREllis, KC Design, synthesis, and biological evaluation of substrate-competitive inhibitors of C-terminal Binding Protein (CtBP). Bioorg Med Chem 24:2707-15 (2016)  
Target
Name:
C-terminal-binding protein 2
Synonyms:
C-terminal-binding protein 2 CTBP2 | CTBP2_HUMAN
Type:
Protein
Mol. Mass.:
48948.33
Organism:
Homo sapiens (Human)
Description:
P56545
Residue:
445
  
Inhibitor
Name:
BDBM50167963
Synonyms:
CHEMBL3799698
Type:
Small organic molecule
Emp. Form.:
C10H10O2
Mol. Mass.:
162.1852
SMILES:
OC(=O)C(=C)Cc1ccccc1
: