Target
C-terminal-binding protein 2
Ligand
BDBM50102174
Substrate
Meas. Tech.
ChEMBL_1574551 (CHEMBL3804623)
IC50
>300000±n/a nM
Citation
 Korwar, SMorris, BLParikh, HICoover, RADoughty, TWLove, IMHilbert, BJRoyer, WEKellogg, GEGrossman, SREllis, KC Design, synthesis, and biological evaluation of substrate-competitive inhibitors of C-terminal Binding Protein (CtBP). Bioorg Med Chem 24:2707-15 (2016)  
Target
Name:
C-terminal-binding protein 2
Synonyms:
C-terminal-binding protein 2 CTBP2 | CTBP2_HUMAN
Type:
Protein
Mol. Mass.:
48948.33
Organism:
Homo sapiens (Human)
Description:
P56545
Residue:
445
  
Inhibitor
Name:
BDBM50102174
Synonyms:
2-oxo-2-phenylacetic acid CHEMBL950 benzeneglyoxylic acid phenylglyoxylic acid
Type:
Small organic molecule
Emp. Form.:
C8H6O3
Mol. Mass.:
150.1314
SMILES:
OC(=O)C(=O)c1ccccc1
: